Reaction Details
TargetTissue factor
LigandBDBM50293392
Substrate/Competitorn/a
Meas. Tech.ChEMBL_572140 (CHEMBL1024282)
IC50>300000±n/a nM
Citation Ayral, EGloanec, PBergé, Gde Nanteuil, GMennecier, PRupin, AVerbeuren, TJFulcrand, PMartinez, JHernandez, JF Design, synthesis, and biological evaluation of 1,5-benzothiazepine-4-one derivatives targeting factor VIIa/tissue factor. Bioorg Med Chem Lett19:1386-91 (2009) 
 
Tissue factor
Name:Tissue factor
Type:PROTEIN
Mol. Mass.:33067.61
Organism:Homo sapiens (Human)
Description:ChEMBL_936735
Residue:295
BDBM50293392
NameBDBM50293392
Synonyms:(R)-2-(3-acetamido-4-oxo-3,4-dihydrobenzo[b][1,4]thiazepin-5(2H)-yl)-N-((6-amino-2-methylpyridin-3-yl)methyl)acetamide, trifluoroacetate | CHEMBL562093
TypeSmall organic molecule
Emp. Form.C20H23N5O3S
Mol. Mass.413.493
SMILESCC(=O)N[C@H]1CSc2ccccc2N(CC(=O)NCc2ccc(N)nc2C)C1=O