Reaction Details
TargetTissue factor
LigandBDBM50293395
Substrate/Competitorn/a
Meas. Tech.ChEMBL_572140 (CHEMBL1024282)
IC50>300000±n/a nM
Citation Ayral, EGloanec, PBergé, Gde Nanteuil, GMennecier, PRupin, AVerbeuren, TJFulcrand, PMartinez, JHernandez, JF Design, synthesis, and biological evaluation of 1,5-benzothiazepine-4-one derivatives targeting factor VIIa/tissue factor. Bioorg Med Chem Lett19:1386-91 (2009) 
 
Tissue factor
Name:Tissue factor
Type:PROTEIN
Mol. Mass.:33067.61
Organism:Homo sapiens (Human)
Description:ChEMBL_936735
Residue:295
BDBM50293395
NameBDBM50293395
Synonyms:(S)-N-((6-amino-2-methylpyridin-3-yl)methyl)-2-(3-amino-4-oxo-3,4-dihydrobenzo[b][1,4]thiazepin-5(2H)-yl)acetamide, bistrifluoroacetate | CHEMBL564165
TypeSmall organic molecule
Emp. Form.C18H21N5O2S
Mol. Mass.371.457
SMILESCc1nc(N)ccc1CNC(=O)CN1c2ccccc2SC[C@@H](N)C1=O