Reaction Details
TargetAldo-keto reductase family 1 member C1
LigandBDBM50293436
Substrate/Competitorn/a
Meas. Tech.ChEMBL_572850 (CHEMBL1033526)
Ki 30500±n/a nM
Citation Stefane, BBrozic, PVehovc, MRizner, TLGobec, S New cyclopentane derivatives as inhibitors of steroid metabolizing enzymes AKR1C1 and AKR1C3. Eur J Med Chem44:2563-71 (2009) 
 
Aldo-keto reductase family 1 member C1
Name:Aldo-keto reductase family 1 member C1
Type:Enzyme
Mol. Mass.:36793.97
Organism:Homo sapiens (Human)
Description:Recombinant AKR1C1 enzyme was expressed in E. coli.
Residue:323
BDBM50293436
NameBDBM50293436
Synonyms:2-(4-chlorobenzylidene)cyclopentyl ethyl ether | CHEMBL538612
TypeSmall organic molecule
Emp. Form.C14H17ClO
Mol. Mass.236.737
SMILESCCOC1CCC\C1=C/c1ccc(Cl)cc1