Reaction Details
TargetAldo-keto reductase family 1 member C1
LigandBDBM50293438
Substrate/Competitorn/a
Meas. Tech.ChEMBL_572850 (CHEMBL1033526)
Ki 35800±n/a nM
Citation Stefane, BBrozic, PVehovc, MRizner, TLGobec, S New cyclopentane derivatives as inhibitors of steroid metabolizing enzymes AKR1C1 and AKR1C3. Eur J Med Chem44:2563-71 (2009) 
 
Aldo-keto reductase family 1 member C1
Name:Aldo-keto reductase family 1 member C1
Type:Enzyme
Mol. Mass.:36793.97
Organism:Homo sapiens (Human)
Description:Recombinant AKR1C1 enzyme was expressed in E. coli.
Residue:323
BDBM50293438
NameBDBM50293438
Synonyms:1-phenylcyclopentanecarboxylic acid | CHEMBL554543
TypeSmall organic molecule
Emp. Form.C12H14O2
Mol. Mass.190.2384
SMILESOC(=O)C1(CCCC1)c1ccccc1