Reaction Details
TargetSodium- and chloride-dependent glycine transporter 1
LigandBDBM50293568
Substrate/Competitorn/a
Meas. Tech.ChEMBL_570823 (CHEMBL792716)
Ki 1.8±n/a nM
Citation Lowe, JAHou, XSchmidt, CDavid Tingley, FMcHardy, SKalman, MDeninno, SSanner, MWard, KLebel, LTunucci, DValentine, JBronk, BSSchaeffer, E The discovery of a structurally novel class of inhibitors of the type 1 glycine transporter. Bioorg Med Chem Lett19:2974-6 (2009) 
 
Sodium- and chloride-dependent glycine transporter 1
Name:Sodium- and chloride-dependent glycine transporter 1
Type:Enzyme
Mol. Mass.:78270.54
Organism:Homo sapiens (Human)
Description:P48067
Residue:706
BDBM50293568
NameBDBM50293568
Synonyms:CHEMBL563761 | Cis-N-(3-Chlorobenzyl)-N-(-4-aminocyclohexyl)-1-methyl-1H-imidazole-4-carboxamide
TypeSmall organic molecule
Emp. Form.C18H23ClN4O
Mol. Mass.346.854
SMILESCn1cnc(c1)C(=O)N(Cc1cccc(Cl)c1)[C@@H]1CC[C@H](N)CC1