Reaction Details
TargetSodium- and chloride-dependent glycine transporter 1
LigandBDBM50293566
Substrate/Competitorn/a
Meas. Tech.ChEMBL_570823 (CHEMBL792716)
Ki 95±n/a nM
Citation Lowe, JAHou, XSchmidt, CDavid Tingley, FMcHardy, SKalman, MDeninno, SSanner, MWard, KLebel, LTunucci, DValentine, JBronk, BSSchaeffer, E The discovery of a structurally novel class of inhibitors of the type 1 glycine transporter. Bioorg Med Chem Lett19:2974-6 (2009) 
 
Sodium- and chloride-dependent glycine transporter 1
Name:Sodium- and chloride-dependent glycine transporter 1
Type:Enzyme
Mol. Mass.:78270.54
Organism:Homo sapiens (Human)
Description:P48067
Residue:706
BDBM50293566
NameBDBM50293566
Synonyms:1-Methyl-1H-imidazole-4-carboxylic acid(3-aza-bicyclo[3.1.0]hex-6-ylmethyl)-(3-chloro-benzyl)-amide | CHEMBL565142
TypeSmall organic molecule
Emp. Form.C18H21ClN4O
Mol. Mass.344.839
SMILESCn1cnc(c1)C(=O)N(C[C@H]1[C@@H]2CNC[C@H]12)Cc1cccc(Cl)c1