Reaction Details
TargetSodium- and chloride-dependent glycine transporter 1
LigandBDBM50293564
Substrate/Competitorn/a
Meas. Tech.ChEMBL_570823 (CHEMBL792716)
Ki 12±n/a nM
Citation Lowe, JAHou, XSchmidt, CDavid Tingley, FMcHardy, SKalman, MDeninno, SSanner, MWard, KLebel, LTunucci, DValentine, JBronk, BSSchaeffer, E The discovery of a structurally novel class of inhibitors of the type 1 glycine transporter. Bioorg Med Chem Lett19:2974-6 (2009) 
 
Sodium- and chloride-dependent glycine transporter 1
Name:Sodium- and chloride-dependent glycine transporter 1
Type:Enzyme
Mol. Mass.:78270.54
Organism:Homo sapiens (Human)
Description:P48067
Residue:706
BDBM50293564
NameBDBM50293564
Synonyms:1-Methyl-1H-imidazole-4-carboxylic acid(3-chloro-4-fluoro-benzyl)-(3-methyl-3-aza-bicyclo[3.1.0]hex-6-ylmethyl)-amide | CHEMBL563251
TypeSmall organic molecule
Emp. Form.C19H22ClFN4O
Mol. Mass.376.856
SMILESCN1C[C@H]2[C@H](CN(Cc3ccc(F)c(Cl)c3)C(=O)c3cn(C)cn3)[C@H]2C1