Reaction Details
TargetGlycogen synthase kinase-3 beta
LigandBDBM50293672
Substrate/Competitorn/a
Meas. Tech.ChEMBL_571643 (CHEMBL1031298)
Ki 24±n/a nM
Citation Bebbington, DBinch, HCharrier, JDEveritt, SFraysse, DGolec, JKay, DKnegtel, RMak, CMazzei, FMiller, AMortimore, MO'Donnell, MPatel, SPierard, FPinder, JPollard, JRamaya, SRobinson, DRutherford, AStudley, JWestcott, J The discovery of the potent aurora inhibitor MK-0457 (VX-680). Bioorg Med Chem Lett19:3586-92 (2009) 
 
Glycogen synthase kinase-3 beta
Name:Glycogen synthase kinase-3 beta
Type:Enzyme
Mol. Mass.:46756.38
Organism:Homo sapiens (Human)
Description:P49841
Residue:420
BDBM50293672
NameBDBM50293672
Synonyms:CHEMBL552038 | N4-(5-methyl-1H-pyrazol-3-yl)-N2-phenylquinazoline-2,4-diamine
TypeSmall organic molecule
Emp. Form.C18H16N6
Mol. Mass.316.3598
SMILESCc1cc(Nc2nc(Nc3ccccc3)nc3ccccc23)[nH]n1