Reaction Details
TargetGlycogen synthase kinase-3 beta
LigandBDBM50277585
Substrate/Competitorn/a
Meas. Tech.ChEMBL_571643 (CHEMBL1031298)
Ki 1034±n/a nM
Citation Bebbington, DBinch, HCharrier, JDEveritt, SFraysse, DGolec, JKay, DKnegtel, RMak, CMazzei, FMiller, AMortimore, MO'Donnell, MPatel, SPierard, FPinder, JPollard, JRamaya, SRobinson, DRutherford, AStudley, JWestcott, J The discovery of the potent aurora inhibitor MK-0457 (VX-680). Bioorg Med Chem Lett19:3586-92 (2009) 
 
Glycogen synthase kinase-3 beta
Name:Glycogen synthase kinase-3 beta
Type:Enzyme
Mol. Mass.:46756.38
Organism:Homo sapiens (Human)
Description:P49841
Residue:420
BDBM50277585
NameBDBM50277585
Synonyms:CHEMBL484950 N-(4-(4-(5-methyl-1H-pyrazol-3-ylamino)quinazolin-2-ylthio)phenyl)acetamide
TypeSmall organic molecule
Emp. Form.C20H18N6OS
Mol. Mass.390.462
SMILESCC(=O)Nc1ccc(Sc2nc(Nc3cc(C)n[nH]3)c3ccccc3n2)cc1