Reaction Details
TargetAurora kinase A
LigandBDBM50293673
Substrate/Competitorn/a
Meas. Tech.ChEMBL_571639 (CHEMBL1031294)
Ki 17±n/a nM
Citation Bebbington, DBinch, HCharrier, JDEveritt, SFraysse, DGolec, JKay, DKnegtel, RMak, CMazzei, FMiller, AMortimore, MO'Donnell, MPatel, SPierard, FPinder, JPollard, JRamaya, SRobinson, DRutherford, AStudley, JWestcott, J The discovery of the potent aurora inhibitor MK-0457 (VX-680). Bioorg Med Chem Lett19:3586-92 (2009) 
 
Aurora kinase A
Name:Aurora kinase A
Type:Serine/threonine-protein kinase
Mol. Mass.:45830.98
Organism:Homo sapiens (Human)
Description:O14965
Residue:403
BDBM50293673
NameBDBM50293673
Synonyms:CHEMBL550825 | N2-methyl-N4-(5-methyl-1H-pyrazol-3-yl)-N2-phenylquinazoline-2,4-diamine
TypeSmall organic molecule
Emp. Form.C19H18N6
Mol. Mass.330.3864
SMILESCN(c1ccccc1)c1nc(Nc2cc(C)n[nH]2)c2ccccc2n1