Reaction Details
TargetAurora kinase A
LigandBDBM50293688
Substrate/Competitorn/a
Meas. Tech.ChEMBL_571639 (CHEMBL1031294)
Ki 9±n/a nM
Citation Bebbington, DBinch, HCharrier, JDEveritt, SFraysse, DGolec, JKay, DKnegtel, RMak, CMazzei, FMiller, AMortimore, MO'Donnell, MPatel, SPierard, FPinder, JPollard, JRamaya, SRobinson, DRutherford, AStudley, JWestcott, J The discovery of the potent aurora inhibitor MK-0457 (VX-680). Bioorg Med Chem Lett19:3586-92 (2009) 
 
Aurora kinase A
Name:Aurora kinase A
Type:Serine/threonine-protein kinase
Mol. Mass.:45830.98
Organism:Homo sapiens (Human)
Description:O14965
Residue:403
BDBM50293688
NameBDBM50293688
Synonyms:CHEMBL556460 | tert-butyl 4-(4-(5-methyl-1H-pyrazol-3-ylamino)quinazolin-2-ylthio)phenylcarbamate
TypeSmall organic molecule
Emp. Form.C23H24N6O2S
Mol. Mass.448.541
SMILESCc1cc(Nc2nc(Sc3ccc(NC(=O)OC(C)(C)C)cc3)nc3ccccc23)[nH]n1