Reaction Details
TargetAurora kinase A
LigandBDBM50277679
Substrate/Competitorn/a
Meas. Tech.ChEMBL_571639 (CHEMBL1031294)
Ki 1.3±n/a nM
Citation Bebbington, DBinch, HCharrier, JDEveritt, SFraysse, DGolec, JKay, DKnegtel, RMak, CMazzei, FMiller, AMortimore, MO'Donnell, MPatel, SPierard, FPinder, JPollard, JRamaya, SRobinson, DRutherford, AStudley, JWestcott, J The discovery of the potent aurora inhibitor MK-0457 (VX-680). Bioorg Med Chem Lett19:3586-92 (2009) 
 
Aurora kinase A
Name:Aurora kinase A
Type:Serine/threonine-protein kinase
Mol. Mass.:45830.98
Organism:Homo sapiens (Human)
Description:O14965
Residue:403
BDBM50277679
NameBDBM50277679
Synonyms:CHEMBL484006 | N-(4-(4-(4-tert-butylpiperazin-1-yl)-6-(5-methyl-1H-pyrazol-3-ylamino)pyrimidin-2-ylthio)phenyl)propionamide
TypeSmall organic molecule
Emp. Form.C25H34N8OS
Mol. Mass.494.655
SMILESCCC(=O)Nc1ccc(Sc2nc(Nc3cc(C)n[nH]3)cc(n2)N2CCN(CC2)C(C)(C)C)cc1