Reaction Details
TargetProto-oncogene tyrosine-protein kinase Src
LigandBDBM50293686
Substrate/Competitorn/a
Meas. Tech.ChEMBL_571642 (CHEMBL1031297)
Ki>500±n/a nM
Citation Bebbington, DBinch, HCharrier, JDEveritt, SFraysse, DGolec, JKay, DKnegtel, RMak, CMazzei, FMiller, AMortimore, MO'Donnell, MPatel, SPierard, FPinder, JPollard, JRamaya, SRobinson, DRutherford, AStudley, JWestcott, J The discovery of the potent aurora inhibitor MK-0457 (VX-680). Bioorg Med Chem Lett19:3586-92 (2009) 
 
Proto-oncogene tyrosine-protein kinase Src
Name:Proto-oncogene tyrosine-protein kinase Src
Type:Protein
Mol. Mass.:59838.60
Organism:Homo sapiens (Human)
Description:P12931
Residue:536
BDBM50293686
NameBDBM50293686
Synonyms:CHEMBL559900 | N-(5-methyl-1H-pyrazol-3-yl)-2-(naphthalen-2-ylthio)quinazolin-4-amine
TypeSmall organic molecule
Emp. Form.C22H17N5S
Mol. Mass.383.469
SMILESCc1cc(Nc2nc(Sc3ccc4ccccc4c3)nc3ccccc23)[nH]n1