Reaction Details
TargetProto-oncogene tyrosine-protein kinase Src
LigandBDBM50293687
Substrate/Competitorn/a
Meas. Tech.ChEMBL_571642 (CHEMBL1031297)
Ki 681±n/a nM
Citation Bebbington, DBinch, HCharrier, JDEveritt, SFraysse, DGolec, JKay, DKnegtel, RMak, CMazzei, FMiller, AMortimore, MO'Donnell, MPatel, SPierard, FPinder, JPollard, JRamaya, SRobinson, DRutherford, AStudley, JWestcott, J The discovery of the potent aurora inhibitor MK-0457 (VX-680). Bioorg Med Chem Lett19:3586-92 (2009) 
 
Proto-oncogene tyrosine-protein kinase Src
Name:Proto-oncogene tyrosine-protein kinase Src
Type:Protein
Mol. Mass.:59838.60
Organism:Homo sapiens (Human)
Description:P12931
Residue:536
BDBM50293687
NameBDBM50293687
Synonyms:CHEMBL552033 | N-(4-(4-(5-methyl-1H-pyrazol-3-ylamino)quinazolin-2-ylthio)phenyl)methanesulfonamide
TypeSmall organic molecule
Emp. Form.C19H18N6O2S2
Mol. Mass.426.515
SMILESCc1cc(Nc2nc(Sc3ccc(NS(C)(=O)=O)cc3)nc3ccccc23)[nH]n1