Reaction Details
TargetKinesin-like protein KIF3B
LigandBDBM50293776
Substrate/Competitorn/a
Meas. Tech.ChEMBL_571922 (CHEMBL1035571)
IC50>50000±n/a nM
Citation Lahue, BRMa, YShipps, GWSeghezzi, WHerbst, R Substituted benzimidazoles: A novel chemotype for small molecule hKSP inhibitors. Bioorg Med Chem Lett19:3405-9 (2009) 
 
Kinesin-like protein KIF3B
Name:Kinesin-like protein KIF3B
Type:PROTEIN
Mol. Mass.:85132.22
Organism:Homo sapiens (Human)
Description:ChEMBL_571922
Residue:747
BDBM50293776
NameBDBM50293776
Synonyms:2-(2-morpholinoethylamino)-1-(2-(trifluoromethyl)benzyl)-1H-benzo[d]imidazole-5-carboxylic acid | CHEMBL549873
TypeSmall organic molecule
Emp. Form.C22H23F3N4O3
Mol. Mass.448.4382
SMILESOC(=O)c1ccc2n(Cc3ccccc3C(F)(F)F)c(NCCN3CCOCC3)nc2c1