Reaction Details
TargetKinesin heavy chain isoform 5A
LigandBDBM50293752
Substrate/Competitorn/a
Meas. Tech.ChEMBL_571923 (CHEMBL1035572)
IC50>50000±n/a nM
Citation Lahue, BRMa, YShipps, GWSeghezzi, WHerbst, R Substituted benzimidazoles: A novel chemotype for small molecule hKSP inhibitors. Bioorg Med Chem Lett19:3405-9 (2009) 
 
Kinesin heavy chain isoform 5A
Name:Kinesin heavy chain isoform 5A
Type:PROTEIN
Mol. Mass.:117363.74
Organism:Homo sapiens (Human)
Description:ChEMBL_818702
Residue:1032
BDBM50293752
NameBDBM50293752
Synonyms:1-(benzo[b]thiophen-3-ylmethyl)-2-(4-sulfamoylphenylamino)-1H-benzo[d]imidazole-5-carboxamide | CHEMBL557683
TypeSmall organic molecule
Emp. Form.C23H19N5O3S2
Mol. Mass.477.559
SMILESNC(=O)c1ccc2n(Cc3csc4ccccc34)c(Nc3ccc(cc3)S(N)(=O)=O)nc2c1