Reaction Details
TargetKinesin heavy chain isoform 5A
LigandBDBM50293768
Substrate/Competitorn/a
Meas. Tech.ChEMBL_571923 (CHEMBL1035572)
IC50>50000±n/a nM
Citation Lahue, BRMa, YShipps, GWSeghezzi, WHerbst, R Substituted benzimidazoles: A novel chemotype for small molecule hKSP inhibitors. Bioorg Med Chem Lett19:3405-9 (2009) 
 
Kinesin heavy chain isoform 5A
Name:Kinesin heavy chain isoform 5A
Type:PROTEIN
Mol. Mass.:117363.74
Organism:Homo sapiens (Human)
Description:ChEMBL_818702
Residue:1032
BDBM50293768
NameBDBM50293768
Synonyms:4-(5-(pyrrolidine-1-carbonyl)-1-(2-(trifluoromethyl)benzyl)-1H-benzo[d]imidazol-2-ylamino)benzenesulfonamide | CHEMBL559435
TypeSmall organic molecule
Emp. Form.C26H24F3N5O3S
Mol. Mass.543.561
SMILESNS(=O)(=O)c1ccc(Nc2nc3cc(ccc3n2Cc2ccccc2C(F)(F)F)C(=O)N2CCCC2)cc1