Reaction Details
TargetKinesin heavy chain isoform 5A
LigandBDBM50293773
Substrate/Competitorn/a
Meas. Tech.ChEMBL_571923 (CHEMBL1035572)
IC50>50000±n/a nM
Citation Lahue, BRMa, YShipps, GWSeghezzi, WHerbst, R Substituted benzimidazoles: A novel chemotype for small molecule hKSP inhibitors. Bioorg Med Chem Lett19:3405-9 (2009) 
 
Kinesin heavy chain isoform 5A
Name:Kinesin heavy chain isoform 5A
Type:PROTEIN
Mol. Mass.:117363.74
Organism:Homo sapiens (Human)
Description:ChEMBL_818702
Residue:1032
BDBM50293773
NameBDBM50293773
Synonyms:2-(4-methoxybenzylamino)-1-(2-(trifluoromethyl)benzyl)-1H-benzo[d]imidazole-5-carboxylic acid | CHEMBL559958
TypeSmall organic molecule
Emp. Form.C24H20F3N3O3
Mol. Mass.455.4291
SMILESCOc1ccc(CNc2nc3cc(ccc3n2Cc2ccccc2C(F)(F)F)C(O)=O)cc1