Reaction Details
TargetRas-related C3 botulinum toxin substrate 1
LigandBDBM50293840
Substrate/Competitorn/a
Meas. Tech.ChEMBL_572380 (CHEMBL1035281)
IC50 24100±n/a nM
Citation Ferri, NCorsini, ABottino, PClerici, FContini, A Virtual screening approach for the identification of new Rac1 inhibitors. J Med Chem52:4087-90 (2009) 
 
Ras-related C3 botulinum toxin substrate 1
Name:Ras-related C3 botulinum toxin substrate 1
Type:PROTEIN
Mol. Mass.:21455.91
Organism:Homo sapiens (Human)
Description:ChEMBL_1337921
Residue:192
BDBM50293840
NameBDBM50293840
Synonyms:CHEMBL562095 | N-(4-methoxy-3-(piperidin-1-ylsulfonyl)phenyl)-1H-indazole-3-carboxamide
TypeSmall organic molecule
Emp. Form.C20H22N4O4S
Mol. Mass.414.478
SMILESCOc1ccc(NC(=O)c2n[nH]c3ccccc23)cc1S(=O)(=O)N1CCCCC1