Reaction Details
TargetCorticotropin-releasing factor receptor 1
LigandBDBM50293912
Substrate/Competitorn/a
Meas. Tech.ChEMBL_572729 (CHEMBL1030153)
IC50 1.9±n/a nM
Citation Hartz, RAAhuja, VTArvanitis, AGRafalski, MYue, EWDenhart, DJSchmitz, WDDitta, JLDeskus, JABrenner, ABHobbs, FWPayne, JLelas, SLi, YWMolski, TFMattson, GKPeng, YWong, HGrace, JELentz, KAQian-Cutrone, JZhuo, XShu, YZLodge, NJZaczek, RCombs, APOlson, REBronson, JJMattson, RJMacor, JE Synthesis, structure-activity relationships, and in vivo evaluation of N3-phenylpyrazinones as novel corticotropin-releasing factor-1 (CRF1) receptor antagonists. J Med Chem52:4173-91 (2009) 
 
Corticotropin-releasing factor receptor 1
Name:Corticotropin-releasing factor receptor 1
Type:Enzyme
Mol. Mass.:50744.31
Organism:Homo sapiens (Human)
Description:P34998
Residue:444
BDBM50293912
NameBDBM50293912
Synonyms:(R)-5-chloro-1-(1-cyclopropyl-2-methoxyethyl)-3-(4-methoxy-2,5-dimethylphenylamino)pyrazin-2(1H)-one | CHEMBL559437
TypeSmall organic molecule
Emp. Form.C19H24ClN3O3
Mol. Mass.377.865
SMILESCOC[C@@H](C1CC1)n1cc(Cl)nc(Nc2cc(C)c(OC)cc2C)c1=O