Reaction Details
TargetCarbonic anhydrase 1
LigandBDBM50294017
Substrate/Competitorn/a
Meas. Tech.ChEMBL_572880 (CHEMBL1034440)
Ki 620±n/a nM
Citation Nasr, GPetit, EVullo, DWinum, JYSupuran, CTBarboiu, M Carbonic anhydrase-encoded dynamic constitutional libraries: toward the discovery of isozyme-specific inhibitors. J Med Chem52:4853-9 (2009) 
 
Carbonic anhydrase 1
Name:Carbonic anhydrase 1
Type:Enzyme
Mol. Mass.:28873.37
Organism:Homo sapiens (Human)
Description:P00915
Residue:261
BDBM50294017
NameBDBM50294017
Synonyms:CHEMBL549940 | N-(2-fluorobenzylidene)(4-sulfonamidephenyl)ethanamine
TypeSmall organic molecule
Emp. Form.C15H15FN2O2S
Mol. Mass.306.355
SMILESNS(=O)(=O)c1ccc(CC\N=C\c2ccccc2F)cc1