Reaction Details
TargetCarbonic anhydrase 1
LigandBDBM50294018
Substrate/Competitorn/a
Meas. Tech.ChEMBL_572880 (CHEMBL1034440)
Ki 260±n/a nM
Citation Nasr, GPetit, EVullo, DWinum, JYSupuran, CTBarboiu, M Carbonic anhydrase-encoded dynamic constitutional libraries: toward the discovery of isozyme-specific inhibitors. J Med Chem52:4853-9 (2009) 
 
Carbonic anhydrase 1
Name:Carbonic anhydrase 1
Type:Enzyme
Mol. Mass.:28873.37
Organism:Homo sapiens (Human)
Description:P00915
Residue:261
BDBM50294018
NameBDBM50294018
Synonyms:CHEMBL549331 | N-(2-Fluorobenzyl)(4-sulphonamide phenyl)ethanamine
TypeSmall organic molecule
Emp. Form.C15H17FN2O2S
Mol. Mass.308.371
SMILESNS(=O)(=O)c1ccc(CCNCc2ccccc2F)cc1