Reaction Details
TargetCarbonic anhydrase 1
LigandBDBM50294019
Substrate/Competitorn/a
Meas. Tech.ChEMBL_572880 (CHEMBL1034440)
Ki 35±n/a nM
Citation Nasr, GPetit, EVullo, DWinum, JYSupuran, CTBarboiu, M Carbonic anhydrase-encoded dynamic constitutional libraries: toward the discovery of isozyme-specific inhibitors. J Med Chem52:4853-9 (2009) 
 
Carbonic anhydrase 1
Name:Carbonic anhydrase 1
Type:Enzyme
Mol. Mass.:28873.37
Organism:Homo sapiens (Human)
Description:P00915
Residue:261
BDBM50294019
NameBDBM50294019
Synonyms:(5-imino-2-sulfonic acid furane)(4-sulfonamidephenyl)ethanamine | CHEMBL564969
TypeSmall organic molecule
Emp. Form.C13H14N2O6S2
Mol. Mass.358.39
SMILESNS(=O)(=O)c1ccc(CC\N=C\c2ccc(o2)S(O)(=O)=O)cc1