Reaction Details
TargetCarbonic anhydrase 1
LigandBDBM50294021
Substrate/Competitorn/a
Meas. Tech.ChEMBL_572880 (CHEMBL1034440)
Ki 65±n/a nM
Citation Nasr, GPetit, EVullo, DWinum, JYSupuran, CTBarboiu, M Carbonic anhydrase-encoded dynamic constitutional libraries: toward the discovery of isozyme-specific inhibitors. J Med Chem52:4853-9 (2009) 
 
Carbonic anhydrase 1
Name:Carbonic anhydrase 1
Type:Enzyme
Mol. Mass.:28873.37
Organism:Homo sapiens (Human)
Description:P00915
Residue:261
BDBM50294021
NameBDBM50294021
Synonyms:CHEMBL563360 | N-(3-carboxybenzylidene)(4-sulphonamidephenyl)ethanamine
TypeSmall organic molecule
Emp. Form.C16H16N2O4S
Mol. Mass.332.374
SMILESNS(=O)(=O)c1ccc(CC\N=C\c2cccc(c2)C(O)=O)cc1