Reaction Details
TargetCarbonic anhydrase 1
LigandBDBM50294022
Substrate/Competitorn/a
Meas. Tech.ChEMBL_572880 (CHEMBL1034440)
Ki 39±n/a nM
Citation Nasr, GPetit, EVullo, DWinum, JYSupuran, CTBarboiu, M Carbonic anhydrase-encoded dynamic constitutional libraries: toward the discovery of isozyme-specific inhibitors. J Med Chem52:4853-9 (2009) 
 
Carbonic anhydrase 1
Name:Carbonic anhydrase 1
Type:Enzyme
Mol. Mass.:28873.37
Organism:Homo sapiens (Human)
Description:P00915
Residue:261
BDBM50294022
NameBDBM50294022
Synonyms:CHEMBL558877 | N-(3-Carboxybenzyl)(4-sulphonamidephenyl)ethanamine
TypeSmall organic molecule
Emp. Form.C16H18N2O4S
Mol. Mass.334.39
SMILESNS(=O)(=O)c1ccc(CCNCc2cccc(c2)C(O)=O)cc1