Reaction Details
TargetCarbonic anhydrase 1
LigandBDBM50294024
Substrate/Competitorn/a
Meas. Tech.ChEMBL_572880 (CHEMBL1034440)
Ki>100000±n/a nM
Citation Nasr, GPetit, EVullo, DWinum, JYSupuran, CTBarboiu, M Carbonic anhydrase-encoded dynamic constitutional libraries: toward the discovery of isozyme-specific inhibitors. J Med Chem52:4853-9 (2009) 
 
Carbonic anhydrase 1
Name:Carbonic anhydrase 1
Type:Enzyme
Mol. Mass.:28873.37
Organism:Homo sapiens (Human)
Description:P00915
Residue:261
BDBM50294024
NameBDBM50294024
Synonyms:CHEMBL549745 | N-benzyl(2-fluorophenyl)methanamine
TypeSmall organic molecule
Emp. Form.C14H14FN
Mol. Mass.215.2661
SMILESFc1ccccc1CNCc1ccccc1