Reaction Details
TargetCarbonic anhydrase 1
LigandBDBM50294025
Substrate/Competitorn/a
Meas. Tech.ChEMBL_572880 (CHEMBL1034440)
Ki 8960±n/a nM
Citation Nasr, GPetit, EVullo, DWinum, JYSupuran, CTBarboiu, M Carbonic anhydrase-encoded dynamic constitutional libraries: toward the discovery of isozyme-specific inhibitors. J Med Chem52:4853-9 (2009) 
 
Carbonic anhydrase 1
Name:Carbonic anhydrase 1
Type:Enzyme
Mol. Mass.:28873.37
Organism:Homo sapiens (Human)
Description:P00915
Residue:261
BDBM50294025
NameBDBM50294025
Synonyms:(5-imino-2-sulfonic acid furane)(phenyl)methanamine | CHEMBL561760
TypeSmall organic molecule
Emp. Form.C12H11NO4S
Mol. Mass.265.285
SMILESOS(=O)(=O)c1ccc(\C=N\Cc2ccccc2)o1