Reaction Details
TargetCarbonic anhydrase 1
LigandBDBM50294028
Substrate/Competitorn/a
Meas. Tech.ChEMBL_572880 (CHEMBL1034440)
Ki>100000±n/a nM
Citation Nasr, GPetit, EVullo, DWinum, JYSupuran, CTBarboiu, M Carbonic anhydrase-encoded dynamic constitutional libraries: toward the discovery of isozyme-specific inhibitors. J Med Chem52:4853-9 (2009) 
 
Carbonic anhydrase 1
Name:Carbonic anhydrase 1
Type:Enzyme
Mol. Mass.:28873.37
Organism:Homo sapiens (Human)
Description:P00915
Residue:261
BDBM50294028
NameBDBM50294028
Synonyms:3-((benzylamino)methyl)benzoic acid | CHEMBL556130
TypeSmall organic molecule
Emp. Form.C15H15NO2
Mol. Mass.241.2851
SMILESOC(=O)c1cccc(CNCc2ccccc2)c1