Reaction Details
TargetCarbonic anhydrase 2
LigandBDBM50294019
Substrate/Competitorn/a
Meas. Tech.ChEMBL_572881 (CHEMBL1034441)
Ki 4.9±n/a nM
Citation Nasr, GPetit, EVullo, DWinum, JYSupuran, CTBarboiu, M Carbonic anhydrase-encoded dynamic constitutional libraries: toward the discovery of isozyme-specific inhibitors. J Med Chem52:4853-9 (2009) 
 
Carbonic anhydrase 2
Name:Carbonic anhydrase 2
Type:Enzyme
Mol. Mass.:29250.71
Organism:Homo sapiens (Human)
Description:P00918
Residue:260
BDBM50294019
NameBDBM50294019
Synonyms:(5-imino-2-sulfonic acid furane)(4-sulfonamidephenyl)ethanamine | CHEMBL564969
TypeSmall organic molecule
Emp. Form.C13H14N2O6S2
Mol. Mass.358.39
SMILESNS(=O)(=O)c1ccc(CC\N=C\c2ccc(o2)S(O)(=O)=O)cc1