Reaction Details
TargetCarbonic anhydrase 2
LigandBDBM50294022
Substrate/Competitorn/a
Meas. Tech.ChEMBL_572881 (CHEMBL1034441)
Ki 57±n/a nM
Citation Nasr, GPetit, EVullo, DWinum, JYSupuran, CTBarboiu, M Carbonic anhydrase-encoded dynamic constitutional libraries: toward the discovery of isozyme-specific inhibitors. J Med Chem52:4853-9 (2009) 
 
Carbonic anhydrase 2
Name:Carbonic anhydrase 2
Type:Enzyme
Mol. Mass.:29250.71
Organism:Homo sapiens (Human)
Description:P00918
Residue:260
BDBM50294022
NameBDBM50294022
Synonyms:CHEMBL558877 | N-(3-Carboxybenzyl)(4-sulphonamidephenyl)ethanamine
TypeSmall organic molecule
Emp. Form.C16H18N2O4S
Mol. Mass.334.39
SMILESNS(=O)(=O)c1ccc(CCNCc2cccc(c2)C(O)=O)cc1