Reaction Details
TargetCarbonic anhydrase 2
LigandBDBM50294024
Substrate/Competitorn/a
Meas. Tech.ChEMBL_572881 (CHEMBL1034441)
Ki>100000±n/a nM
Citation Nasr, GPetit, EVullo, DWinum, JYSupuran, CTBarboiu, M Carbonic anhydrase-encoded dynamic constitutional libraries: toward the discovery of isozyme-specific inhibitors. J Med Chem52:4853-9 (2009) 
 
Carbonic anhydrase 2
Name:Carbonic anhydrase 2
Type:Enzyme
Mol. Mass.:29250.71
Organism:Homo sapiens (Human)
Description:P00918
Residue:260
BDBM50294024
NameBDBM50294024
Synonyms:CHEMBL549745 | N-benzyl(2-fluorophenyl)methanamine
TypeSmall organic molecule
Emp. Form.C14H14FN
Mol. Mass.215.2661
SMILESFc1ccccc1CNCc1ccccc1