Reaction Details
TargetCarbonic anhydrase 2
LigandBDBM50294025
Substrate/Competitorn/a
Meas. Tech.ChEMBL_572881 (CHEMBL1034441)
Ki>100000±n/a nM
Citation Nasr, GPetit, EVullo, DWinum, JYSupuran, CTBarboiu, M Carbonic anhydrase-encoded dynamic constitutional libraries: toward the discovery of isozyme-specific inhibitors. J Med Chem52:4853-9 (2009) 
 
Carbonic anhydrase 2
Name:Carbonic anhydrase 2
Type:Enzyme
Mol. Mass.:29250.71
Organism:Homo sapiens (Human)
Description:P00918
Residue:260
BDBM50294025
NameBDBM50294025
Synonyms:(5-imino-2-sulfonic acid furane)(phenyl)methanamine | CHEMBL561760
TypeSmall organic molecule
Emp. Form.C12H11NO4S
Mol. Mass.265.285
SMILESOS(=O)(=O)c1ccc(\C=N\Cc2ccccc2)o1