Reaction Details
TargetCarbonic anhydrase 2
LigandBDBM50294026
Substrate/Competitorn/a
Meas. Tech.ChEMBL_572881 (CHEMBL1034441)
Ki 8025±n/a nM
Citation Nasr, GPetit, EVullo, DWinum, JYSupuran, CTBarboiu, M Carbonic anhydrase-encoded dynamic constitutional libraries: toward the discovery of isozyme-specific inhibitors. J Med Chem52:4853-9 (2009) 
 
Carbonic anhydrase 2
Name:Carbonic anhydrase 2
Type:Enzyme
Mol. Mass.:29250.71
Organism:Homo sapiens (Human)
Description:P00918
Residue:260
BDBM50294026
NameBDBM50294026
Synonyms:CHEMBL561761 | N-(5-Methane-2-furansulfonicacid)(phenyl)methanamine
TypeSmall organic molecule
Emp. Form.C12H13NO4S
Mol. Mass.267.301
SMILESOS(=O)(=O)c1ccc(CNCc2ccccc2)o1