Reaction Details
TargetCarbonic anhydrase 2
LigandBDBM10880
Substrate/Competitorn/a
Meas. Tech.ChEMBL_572881 (CHEMBL1034441)
Ki 12±n/a nM
Citation Nasr, GPetit, EVullo, DWinum, JYSupuran, CTBarboiu, M Carbonic anhydrase-encoded dynamic constitutional libraries: toward the discovery of isozyme-specific inhibitors. J Med Chem52:4853-9 (2009) 
 
Carbonic anhydrase 2
Name:Carbonic anhydrase 2
Type:Enzyme
Mol. Mass.:29250.71
Organism:Homo sapiens (Human)
Description:P00918
Residue:260
BDBM10880
NameBDBM10880
Synonyms:AZA AZM acetazolamide Acetazolamide Acetazolamide (AZA) Acetazolamide, 5 Acetazolamide, AZA CHEMBL20 Sulfonamide, 1 US11278534, Example acetazolamide sulfonamide 1
TypeSmall organic molecule
Emp. Form.C4H6N4O3S2
Mol. Mass.222.245
SMILESCC(=O)Nc1nnc(s1)S(N)(=O)=O