Reaction Details
TargetCarbonic anhydrase 2
LigandBDBM50294029
Substrate/Competitorn/a
Meas. Tech.ChEMBL_572882 (CHEMBL1034442)
Ki 460000±n/a nM
Citation Nasr, GPetit, EVullo, DWinum, JYSupuran, CTBarboiu, M Carbonic anhydrase-encoded dynamic constitutional libraries: toward the discovery of isozyme-specific inhibitors. J Med Chem52:4853-9 (2009) 
 
Carbonic anhydrase 2
Name:Carbonic anhydrase 2
Type:Enzyme
Mol. Mass.:29250.71
Organism:Homo sapiens (Human)
Description:P00918
Residue:260
BDBM50294029
NameBDBM50294029
Synonyms:CHEMBL541253 p-toluenesulfonate
TypeSmall organic molecule
Emp. Form.C7H8O3S
Mol. Mass.172.202
SMILESCc1ccc(cc1)S(O)(=O)=O