Reaction Details
TargetMultidrug resistance-associated protein 1
LigandBDBM50084979
Substrate/Competitorn/a
Meas. Tech.ChEMBL_572897 (CHEMBL1035259)
IC50 1100±n/a nM
Citation Häcker, HGLeyers, SWiendlocha, JGütschow, MWiese, M Aromatic 2-(thio)ureidocarboxylic acids as a new family of modulators of multidrug resistance-associated protein 1: synthesis, biological evaluation, and structure-activity relationships. J Med Chem52:4586-95 (2009) 
 
Multidrug resistance-associated protein 1
Name:Multidrug resistance-associated protein 1
Type:n/a
Mol. Mass.:171597.72
Organism:Homo sapiens (Human)
Description:P33527
Residue:1531
BDBM50084979
NameBDBM50084979
Synonyms:3,5,7-Trihydroxy-2-[3-(4-hydroxy-3-methoxy-phenyl)-2-hydroxymethyl-2,3-dihydro-benzo[1,4]dioxin-6-yl]-chromen-4-one Dehydrosilybin | Dehydrosilylbin
TypeSmall organic molecule
Emp. Form.C25H20O10
Mol. Mass.480.4203
SMILESCOc1cc(ccc1O)C1Oc2cc(ccc2OC1CO)-c1oc2cc(O)cc(=O)c2c(O)c1O