Reaction Details
TargetPolyamine oxidase 1
LigandBDBM50294103
Substrate/Competitorn/a
Meas. Tech.ChEMBL_570655 (CHEMBL1033595)
pH6.5±n/a
Ki 700±n/a nM
Commentsextracted
Citation Manetti, FCona, AAngeli, LMugnaini, CRaffi, FCapone, CDreassi, EZizzari, ATTisi, AFederico, RBotta, M Synthesis and biological evaluation of guanidino compounds endowed with subnanomolar affinity as competitive inhibitors of maize polyamine oxidase. J Med Chem52:4774-85 (2009) 
 
Polyamine oxidase 1
Name:Polyamine oxidase 1
Type:PROTEIN
Mol. Mass.:56339.65
Organism:Zea mays
Description:ChEMBL_570655
Residue:500
BDBM50294103
NameBDBM50294103
Synonyms:4-[N3-gamma,gamma-Dimethyallyl)guanidino]-1-guanidino-butane bis(trifluoroacetate) | CHEMBL549342
TypeSmall organic molecule
Emp. Form.C11H24N6
Mol. Mass.240.3485
SMILES[#6]\[#6](-[#6])=[#6]\[#6]-[#7]-[#6](-[#7])=[#7]-[#6]-[#6]-[#6]-[#6]\[#7]=[#6](\[#7])-[#7]