Reaction Details
TargetD(4) dopamine receptor
LigandBDBM50294117
Substrate/Competitorn/a
Meas. Tech.ChEMBL_571059 (CHEMBL1027776)
Ki 2.3±n/a nM
Citation Ehrlich, KGötz, ABollinger, STschammer, NBettinetti, LHärterich, SHübner, HLanig, HGmeiner, P Dopamine D2, D3, and D4 selective phenylpiperazines as molecular probes to explore the origins of subtype specific receptor binding. J Med Chem52:4923-35 (2009) 
 
D(4) dopamine receptor
Name:D(4) dopamine receptor
Type:Enzyme
Mol. Mass.:48373.19
Organism:Homo sapiens (Human)
Description:P21917
Residue:419
BDBM50294117
NameBDBM50294117
Synonyms:2-((4-(2-methoxyphenyl)piperazin-1-yl)methyl)H-pyrazolo[1,5-a]pyridine | CHEMBL562620
TypeSmall organic molecule
Emp. Form.C19H22N4O
Mol. Mass.322.4042
SMILESCOc1ccccc1N1CCN(Cc2cc3ccccn3n2)CC1