Reaction Details
TargetDihydrofolate reductase
LigandBDBM50294214
Substrate/Competitorn/a
Meas. Tech.ChEMBL_577084 (CHEMBL1031974)
IC50>42000±n/a nM
Citation Barrow, EWDreier, JReinelt, SBourne, PCBarrow, WW In vitro efficacy of new antifolates against trimethoprim-resistant Bacillus anthracis. Antimicrob Agents Chemother51:4447-52 (2007) 
 
Dihydrofolate reductase
Name:Dihydrofolate reductase
Type:Enzyme
Mol. Mass.:21453.99
Organism:Homo sapiens (Human)
Description:Recombinant human DHFR.
Residue:187
BDBM50294214
NameBDBM50294214
Synonyms:3-(5-((2,4-diaminopyrimidin-5-yl)methyl)-2,3-dimethoxyphenyl)-1-(1-(2-((dimethylamino)methyl)phenyl)phthalazin-2(1H)-yl)prop-2-en-1-one CHEMBL537959
TypeSmall organic molecule
Emp. Form.C33H35N7O3
Mol. Mass.577.6761
SMILESCOc1cc(Cc2cnc(N)nc2N)cc(\C=C\C(=O)N2N=Cc3ccccc3C2c2ccccc2CN(C)C)c1OC