Reaction Details
TargetSodium-dependent serotonin transporter
LigandBDBM50294257
Substrate/Competitorn/a
Meas. Tech.ChEMBL_575206 (CHEMBL1024553)
IC50 36±n/a nM
Citation Fish, PVAndrews, MDJonathan Fray, MStobie, AWakenhut, FWhitlock, GA 4-Piperidines and 3-pyrrolidines as dual serotonin and noradrenaline reuptake inhibitors: design, synthesis and structure-activity relationships. Bioorg Med Chem Lett19:2829-34 (2009) 
 
Sodium-dependent serotonin transporter
Name:Sodium-dependent serotonin transporter
Type:Multi-pass membrane protein
Mol. Mass.:70322.51
Organism:Homo sapiens (Human)
Description:P31645
Residue:630
BDBM50294257
NameBDBM50294257
Synonyms:2-((2,3-dichlorophenoxy)((S)-pyrrolidin-3-yl)methyl)pyridine | CHEMBL563495
TypeSmall organic molecule
Emp. Form.C16H16Cl2N2O
Mol. Mass.323.217
SMILESClc1cccc(OC([C@H]2CCNC2)c2ccccn2)c1Cl