Reaction Details
TargetSodium-dependent serotonin transporter
LigandBDBM50294258
Substrate/Competitorn/a
Meas. Tech.ChEMBL_575206 (CHEMBL1024553)
IC50 8±n/a nM
Citation Fish, PVAndrews, MDJonathan Fray, MStobie, AWakenhut, FWhitlock, GA 4-Piperidines and 3-pyrrolidines as dual serotonin and noradrenaline reuptake inhibitors: design, synthesis and structure-activity relationships. Bioorg Med Chem Lett19:2829-34 (2009) 
 
Sodium-dependent serotonin transporter
Name:Sodium-dependent serotonin transporter
Type:Multi-pass membrane protein
Mol. Mass.:70322.51
Organism:Homo sapiens (Human)
Description:P31645
Residue:630
BDBM50294258
NameBDBM50294258
Synonyms:CHEMBL541226 | rac-4-((2,3-dichlorophenoxy)(phenyl)methyl)piperidine
TypeSmall organic molecule
Emp. Form.C18H19Cl2NO
Mol. Mass.336.256
SMILESClc1cccc(OC(C2CCNCC2)c2ccccc2)c1Cl