Reaction Details
TargetSodium-dependent noradrenaline transporter
LigandBDBM50294263
Substrate/Competitorn/a
Meas. Tech.ChEMBL_575205 (CHEMBL1024552)
IC50 45±n/a nM
Citation Fish, PVAndrews, MDJonathan Fray, MStobie, AWakenhut, FWhitlock, GA 4-Piperidines and 3-pyrrolidines as dual serotonin and noradrenaline reuptake inhibitors: design, synthesis and structure-activity relationships. Bioorg Med Chem Lett19:2829-34 (2009) 
 
Sodium-dependent noradrenaline transporter
Name:Sodium-dependent noradrenaline transporter
Type:Multi-pass membrane protein
Mol. Mass.:69337.72
Organism:Homo sapiens (Human)
Description:P23975
Residue:617
BDBM50294263
NameBDBM50294263
Synonyms:CHEMBL563852 | rac-3-(piperidin-4-yl(2-(trifluoromethoxy)phenoxy)methyl)pyridine
TypeSmall organic molecule
Emp. Form.C18H19F3N2O2
Mol. Mass.352.3509
SMILESFC(F)(F)Oc1ccccc1OC(C1CCNCC1)c1cccnc1