Reaction Details
TargetSodium-dependent noradrenaline transporter
LigandBDBM50294265
Substrate/Competitorn/a
Meas. Tech.ChEMBL_575205 (CHEMBL1024552)
IC50 23±n/a nM
Citation Fish, PVAndrews, MDJonathan Fray, MStobie, AWakenhut, FWhitlock, GA 4-Piperidines and 3-pyrrolidines as dual serotonin and noradrenaline reuptake inhibitors: design, synthesis and structure-activity relationships. Bioorg Med Chem Lett19:2829-34 (2009) 
 
Sodium-dependent noradrenaline transporter
Name:Sodium-dependent noradrenaline transporter
Type:Multi-pass membrane protein
Mol. Mass.:69337.72
Organism:Homo sapiens (Human)
Description:P23975
Residue:617
BDBM50294265
NameBDBM50294265
Synonyms:CHEMBL549965 | rac-3-((2-phenoxyphenoxy)(piperidin-4-yl)methyl)pyridine
TypeSmall organic molecule
Emp. Form.C23H24N2O2
Mol. Mass.360.4489
SMILESC1CC(CCN1)C(Oc1ccccc1Oc1ccccc1)c1cccnc1