Reaction Details
TargetSodium-dependent noradrenaline transporter
LigandBDBM50294267
Substrate/Competitorn/a
Meas. Tech.ChEMBL_575205 (CHEMBL1024552)
IC50 404±n/a nM
Citation Fish, PVAndrews, MDJonathan Fray, MStobie, AWakenhut, FWhitlock, GA 4-Piperidines and 3-pyrrolidines as dual serotonin and noradrenaline reuptake inhibitors: design, synthesis and structure-activity relationships. Bioorg Med Chem Lett19:2829-34 (2009) 
 
Sodium-dependent noradrenaline transporter
Name:Sodium-dependent noradrenaline transporter
Type:Multi-pass membrane protein
Mol. Mass.:69337.72
Organism:Homo sapiens (Human)
Description:P23975
Residue:617
BDBM50294267
NameBDBM50294267
Synonyms:CHEMBL551443 | rac-3-((3-ethylphenoxy)(piperidin-4-yl)methyl)pyridine
TypeSmall organic molecule
Emp. Form.C19H24N2O
Mol. Mass.296.4067
SMILESCCc1cccc(OC(C2CCNCC2)c2cccnc2)c1