Reaction Details
TargetSodium-dependent noradrenaline transporter
LigandBDBM50294271
Substrate/Competitorn/a
Meas. Tech.ChEMBL_575205 (CHEMBL1024552)
IC50 14±n/a nM
Citation Fish, PVAndrews, MDJonathan Fray, MStobie, AWakenhut, FWhitlock, GA 4-Piperidines and 3-pyrrolidines as dual serotonin and noradrenaline reuptake inhibitors: design, synthesis and structure-activity relationships. Bioorg Med Chem Lett19:2829-34 (2009) 
 
Sodium-dependent noradrenaline transporter
Name:Sodium-dependent noradrenaline transporter
Type:Multi-pass membrane protein
Mol. Mass.:69337.72
Organism:Homo sapiens (Human)
Description:P23975
Residue:617
BDBM50294271
NameBDBM50294271
Synonyms:5-((2,3-dichlorophenoxy)(piperidin-4-yl)methyl)-2-methyl pyridine CHEMBL559081 | rac-3-((2,3-dichloro-6-methylphenoxy)(piperidin-4-yl)methyl)pyridine
TypeSmall organic molecule
Emp. Form.C18H20Cl2N2O
Mol. Mass.351.27
SMILESCc1ccc(cn1)C(Oc1cccc(Cl)c1Cl)C1CCNCC1