Reaction Details
TargetSodium-dependent noradrenaline transporter
LigandBDBM50294277
Substrate/Competitorn/a
Meas. Tech.ChEMBL_575205 (CHEMBL1024552)
IC50 215±n/a nM
Citation Fish, PVAndrews, MDJonathan Fray, MStobie, AWakenhut, FWhitlock, GA 4-Piperidines and 3-pyrrolidines as dual serotonin and noradrenaline reuptake inhibitors: design, synthesis and structure-activity relationships. Bioorg Med Chem Lett19:2829-34 (2009) 
 
Sodium-dependent noradrenaline transporter
Name:Sodium-dependent noradrenaline transporter
Type:Multi-pass membrane protein
Mol. Mass.:69337.72
Organism:Homo sapiens (Human)
Description:P23975
Residue:617
BDBM50294277
NameBDBM50294277
Synonyms:CHEMBL560049 | rac-3-(piperidin-4-yl(2,3,5-trichlorophenoxy)methyl)pyridine
TypeSmall organic molecule
Emp. Form.C17H17Cl3N2O
Mol. Mass.371.689
SMILESClc1cc(Cl)c(Cl)c(OC(C2CCNCC2)c2cccnc2)c1