Reaction Details
TargetSodium-dependent noradrenaline transporter
LigandBDBM50294278
Substrate/Competitorn/a
Meas. Tech.ChEMBL_575205 (CHEMBL1024552)
IC50 33±n/a nM
Citation Fish, PVAndrews, MDJonathan Fray, MStobie, AWakenhut, FWhitlock, GA 4-Piperidines and 3-pyrrolidines as dual serotonin and noradrenaline reuptake inhibitors: design, synthesis and structure-activity relationships. Bioorg Med Chem Lett19:2829-34 (2009) 
 
Sodium-dependent noradrenaline transporter
Name:Sodium-dependent noradrenaline transporter
Type:Multi-pass membrane protein
Mol. Mass.:69337.72
Organism:Homo sapiens (Human)
Description:P23975
Residue:617
BDBM50294278
NameBDBM50294278
Synonyms:CHEMBL563404 | rac2-((biphenyl-2-yloxy)(piperidin-4-yl)methyl)pyridine
TypeSmall organic molecule
Emp. Form.C23H24N2O
Mol. Mass.344.4495
SMILESC1CC(CCN1)C(Oc1ccccc1-c1ccccc1)c1ccccn1