Reaction Details
TargetSodium-dependent serotonin transporter
LigandBDBM50294265
Substrate/Competitorn/a
Meas. Tech.ChEMBL_575206 (CHEMBL1024553)
IC50 76±n/a nM
Citation Fish, PVAndrews, MDJonathan Fray, MStobie, AWakenhut, FWhitlock, GA 4-Piperidines and 3-pyrrolidines as dual serotonin and noradrenaline reuptake inhibitors: design, synthesis and structure-activity relationships. Bioorg Med Chem Lett19:2829-34 (2009) 
 
Sodium-dependent serotonin transporter
Name:Sodium-dependent serotonin transporter
Type:Multi-pass membrane protein
Mol. Mass.:70322.51
Organism:Homo sapiens (Human)
Description:P31645
Residue:630
BDBM50294265
NameBDBM50294265
Synonyms:CHEMBL549965 | rac-3-((2-phenoxyphenoxy)(piperidin-4-yl)methyl)pyridine
TypeSmall organic molecule
Emp. Form.C23H24N2O2
Mol. Mass.360.4489
SMILESC1CC(CCN1)C(Oc1ccccc1Oc1ccccc1)c1cccnc1