Reaction Details
TargetSodium-dependent serotonin transporter
LigandBDBM50294269
Substrate/Competitorn/a
Meas. Tech.ChEMBL_575206 (CHEMBL1024553)
IC50 7±n/a nM
Citation Fish, PVAndrews, MDJonathan Fray, MStobie, AWakenhut, FWhitlock, GA 4-Piperidines and 3-pyrrolidines as dual serotonin and noradrenaline reuptake inhibitors: design, synthesis and structure-activity relationships. Bioorg Med Chem Lett19:2829-34 (2009) 
 
Sodium-dependent serotonin transporter
Name:Sodium-dependent serotonin transporter
Type:Multi-pass membrane protein
Mol. Mass.:70322.51
Organism:Homo sapiens (Human)
Description:P31645
Residue:630
BDBM50294269
NameBDBM50294269
Synonyms:CHEMBL564631 | rac-3-((4-(methylthio)phenoxy)(piperidin-4-yl)methyl)pyridine
TypeSmall organic molecule
Emp. Form.C18H22N2OS
Mol. Mass.314.445
SMILESCSc1ccc(OC(C2CCNCC2)c2cccnc2)cc1