Reaction Details
TargetSodium-dependent serotonin transporter
LigandBDBM50294276
Substrate/Competitorn/a
Meas. Tech.ChEMBL_575206 (CHEMBL1024553)
IC50 10±n/a nM
Citation Fish, PVAndrews, MDJonathan Fray, MStobie, AWakenhut, FWhitlock, GA 4-Piperidines and 3-pyrrolidines as dual serotonin and noradrenaline reuptake inhibitors: design, synthesis and structure-activity relationships. Bioorg Med Chem Lett19:2829-34 (2009) 
 
Sodium-dependent serotonin transporter
Name:Sodium-dependent serotonin transporter
Type:Multi-pass membrane protein
Mol. Mass.:70322.51
Organism:Homo sapiens (Human)
Description:P31645
Residue:630
BDBM50294276
NameBDBM50294276
Synonyms:CHEMBL551646 | rac-3-((3,5-dichlorophenoxy)(piperidin-4-yl)methyl)pyridine
TypeSmall organic molecule
Emp. Form.C17H18Cl2N2O
Mol. Mass.337.244
SMILESClc1cc(Cl)cc(OC(C2CCNCC2)c2cccnc2)c1